aggregation territory
type: Class
subclass of: whole organism
IAO_0000115: Area covered by a group of chemotactic cells converging toward the same aggregation center. Can reach a diameter of up to 1 cm.
has OBO namespace: Dictyostelium_discoideum_anatomy
id: DDANAT:0000003

Axiom
annotated source: aggregation territory
annotated property: IAO_0000115
annotated target: Area covered by a group of chemotactic cells converging toward the same aggregation center. Can reach a diameter of up to 1 cm.
has db xref: DDB:pg
has db xref: PMID:14458213
has db xref: PMID:20268085

loose aggregate
type: Class
subclass of: whole organism
subclass of: Restriction
  on property: RO_0002202
  some values from: aggregation territory
IAO_0000115: First adherent mass of cells observed during development, relatively flat with indistinct borders.
has exact synonym: loose mound
has OBO namespace: Dictyostelium_discoideum_anatomy
id: DDANAT:0000004

Axiom
annotated source: loose aggregate
annotated property: IAO_0000115
annotated target: First adherent mass of cells observed during development, relatively flat with indistinct borders.
has db xref: DDB:pg

mound
type: Class
subclass of: whole organism
subclass of: Restriction
  on property: RO_0002202
  some values from: loose aggregate
IAO_0000115: Hemispherical structure composed of post-aggregative cells that are undergoing differentiation.
has broad synonym: pseudoplasmodium
has exact synonym: tight aggregate
has exact synonym: tight mound
has OBO namespace: Dictyostelium_discoideum_anatomy
id: DDANAT:0000005

Axiom
annotated source: mound
annotated property: IAO_0000115
annotated target: Hemispherical structure composed of post-aggregative cells that are undergoing differentiation.
has db xref: DDB:pg
has db xref: PMID:20268085

Axiom
annotated source: mound
annotated property: hasBroadSynonym
annotated target: pseudoplasmodium
has db xref: PMID:18366659

tipped mound
type: Class
subclass of: whole organism
subclass of: Restriction
  on property: RO_0002202
  some values from: mound
IAO_0000115: Hemispherical structure composed of post-aggregative cells that are undergoing differentiation and that have formed a tip.
has broad synonym: pseudoplasmodium
has exact synonym: tipped aggregate
has OBO namespace: Dictyostelium_discoideum_anatomy
id: DDANAT:0000006

Axiom
annotated source: tipped mound
annotated property: IAO_0000115
annotated target: Hemispherical structure composed of post-aggregative cells that are undergoing differentiation and that have formed a tip.
has db xref: DDB:pg
has db xref: PMID:20268085

Axiom
annotated source: tipped mound
annotated property: hasExactSynonym
annotated target: tipped aggregate
has db xref: PMID:7553878

standing slug
type: Class
subclass of: whole organism
subclass of: Restriction
  on property: RO_0002202
  some values from: tipped mound
IAO_0000115: Cylindrical structure that is formed by elongation of the mound under the control of the tip. The elongating tip is called the first finger.
has broad synonym: pseudoplasmodium
has db xref: ISBN:0521583640
has exact synonym: finger
has narrow synonym: first finger
has OBO namespace: Dictyostelium_discoideum_anatomy
id: DDANAT:0000007
comment: Synonym from Kessin book p. 166.

Axiom
annotated source: standing slug
annotated property: IAO_0000115
annotated target: Cylindrical structure that is formed by elongation of the mound under the control of the tip. The elongating tip is called the first finger.
has db xref: DDB:pg
has db xref: PMID:18366659

migratory slug
type: Class
subclass of: whole organism
subclass of: Restriction
  on property: RO_0002202
  some values from: standing slug
IAO_0000115: When the conditions are not optimal for the completion of development, the standing slug bends from a vertical position to a horizontal position, producing a migratory that slug has the ability to migrate towards more favorable environmental conditions. The slug is cylindrical in shape with a rounded, tapering region at its anterior end that is raised with respect to the substratum. It usually measures between 0.8 to 1.2 mm in length with a diameter of 0.15 to 0.25 mm. Slugs sense and respond to light, temperature and acidity, and do not enter culmination until the conditions are optimal. The slug can move at a speed of 0.5 to 2 mm per hour. A trail of slime is deposited on the surface during migration.
has broad synonym: pseudoplasmodium
has OBO namespace: Dictyostelium_discoideum_anatomy
id: DDANAT:0000008

Axiom
annotated source: migratory slug
annotated property: IAO_0000115
annotated target: When the conditions are not optimal for the completion of development, the standing slug bends from a vertical position to a horizontal position, producing a migratory that slug has the ability to migrate towards more favorable environmental conditions. The slug is cylindrical in shape with a rounded, tapering region at its anterior end that is raised with respect to the substratum. It usually measures between 0.8 to 1.2 mm in length with a diameter of 0.15 to 0.25 mm. Slugs sense and respond to light, temperature and acidity, and do not enter culmination until the conditions are optimal. The slug can move at a speed of 0.5 to 2 mm per hour. A trail of slime is deposited on the surface during migration.
has db xref: DDB:pg
has db xref: PMID:2513127
has db xref: PMID:8223266

Axiom
annotated source: migratory slug
annotated property: hasBroadSynonym
annotated target: pseudoplasmodium
has db xref: PMID:18366659

early culminant
type: Class
subclass of: whole organism
subclass of: Restriction
  on property: RO_0002202
  some values from: standing slug
IAO_0000115: Structure formed after the arrest of slug migration formed when cells of the posterior region of the slug move under the tip. Stalk tube formation is initiated at this stage.
has broad synonym: culminant
has broad synonym: pseudoplasmodium
has narrow synonym: mexican hat
has OBO namespace: Dictyostelium_discoideum_anatomy
id: DDANAT:0000009

Axiom
annotated source: early culminant
annotated property: IAO_0000115
annotated target: Structure formed after the arrest of slug migration formed when cells of the posterior region of the slug move under the tip. Stalk tube formation is initiated at this stage.
has db xref: DDB:pg
has db xref: PMID:18366659
has db xref: PMID:1879341

Axiom
annotated source: early culminant
annotated property: hasBroadSynonym
annotated target: pseudoplasmodium
has db xref: PMID:18366659

mid culminant
type: Class
subclass of: whole organism
subclass of: Restriction
  on property: RO_0002202
  some values from: early culminant
IAO_0000115: Structure in which stalk tube formation has progressed down the prespore zone. Basal disc formation begins at this stage, with the migration of pstA and pstB cells to the lower part of the culminant to form the basal disc.
has broad synonym: culminant
has broad synonym: pseudoplasmodium
has OBO namespace: Dictyostelium_discoideum_anatomy
id: DDANAT:0000010

Axiom
annotated source: mid culminant
annotated property: IAO_0000115
annotated target: Structure in which stalk tube formation has progressed down the prespore zone. Basal disc formation begins at this stage, with the migration of pstA and pstB cells to the lower part of the culminant to form the basal disc.
has db xref: DDB:pg
has db xref: PMID:9799430

Axiom
annotated source: mid culminant
annotated property: hasBroadSynonym
annotated target: pseudoplasmodium
has db xref: PMID:18366659

late culminant
type: Class
subclass of: whole organism
subclass of: Restriction
  on property: RO_0002202
  some values from: mid culminant
IAO_0000115: Structure in which stalk tube formation has progressed down to the basal disc. The sorogen ascents up the stalk to it apical position during this stage. Terminal differentiation occurs at this stage: death of the stalk cells and encapsulation of the spores.
has broad synonym: culminant
has db xref: ISBN:0521583640
has OBO namespace: Dictyostelium_discoideum_anatomy
has related synonym: pseudoplasmodium
id: DDANAT:0000011
comment: Kessin book p. 201.

Axiom
annotated source: late culminant
annotated property: IAO_0000115
annotated target: Structure in which stalk tube formation has progressed down to the basal disc. The sorogen ascents up the stalk to it apical position during this stage. Terminal differentiation occurs at this stage: death of the stalk cells and encapsulation of the spores.
has db xref: DDB:pg
has db xref: PMID:1879341

Axiom
annotated source: late culminant
annotated property: hasRelatedSynonym
annotated target: pseudoplasmodium
has db xref: PMID:18366659

fruiting body
type: Class
subclass of: whole organism
subclass of: Restriction
  on property: RO_0002202
  some values from: late culminant
IAO_0000115: Dicty asexual organism which is terminally differentiated and consists of a long stalk on top of which sits the sorus that contains spores. The mature fruiting body measures between 1.5 to 3 mm in height.
has db xref: ISBN:0521583640
has exact synonym: sorocarp
has OBO namespace: Dictyostelium_discoideum_anatomy
id: DDANAT:0000012
comment: Synonym from Kessin book p. 12-13.

Axiom
annotated source: fruiting body
annotated property: IAO_0000115
annotated target: Dicty asexual organism which is terminally differentiated and consists of a long stalk on top of which sits the sorus that contains spores. The mature fruiting body measures between 1.5 to 3 mm in height.
has db xref: DDB:18366659
has db xref: DDB:pg

stream
type: Class
subclass of: subdivision
subclass of: Restriction
  on property: BFO_0000050
  some values from: aggregation territory
IAO_0000115: Macroscopic appearance of groups of chemotactic cells orienting themselves in a head to tail fashion as they are migrating in the direction of the chemotactic stimulus to form aggregates.
has exact synonym: pseudoplasmodial stream
has OBO namespace: Dictyostelium_discoideum_anatomy
id: DDANAT:0000013

Axiom
annotated source: stream
annotated property: IAO_0000115
annotated target: Macroscopic appearance of groups of chemotactic cells orienting themselves in a head to tail fashion as they are migrating in the direction of the chemotactic stimulus to form aggregates.
has db xref: DDB:18366659
has db xref: DDB:pg

prestalk region of the tipped mound
type: Class
subclass of: prestalk region
subclass of: Restriction
  on property: BFO_0000050
  some values from: tipped mound
subclass of: Restriction
  on property: RO_0002202
  some values from: mound
IAO_0000115: Elongated protusion of the tipped mound located on top of the cell mass that contains pstA cells flanked by pstO cells (expressing ecmA from the proximal and the distal part of its promoter, respectively).
has db xref: PMID:10642783
has db xref: PMID:2513127
has exact synonym: pst region of the tipped mound
has OBO namespace: Dictyostelium_discoideum_anatomy
has related synonym: apical tip of the tipped mound
id: DDANAT:0000016

Axiom
annotated source: prestalk region of the tipped mound
annotated property: IAO_0000115
annotated target: Elongated protusion of the tipped mound located on top of the cell mass that contains pstA cells flanked by pstO cells (expressing ecmA from the proximal and the distal part of its promoter, respectively).
has db xref: DDB:pg

prespore region of the tipped mound
type: Class
subclass of: prespore region
subclass of: Restriction
  on property: BFO_0000050
  some values from: tipped mound
subclass of: Restriction
  on property: RO_0002202
  some values from: mound
IAO_0000115: Region of the tipped mound mostly composed of prespore cells. In addition to prespore cells, the prespore region contains anterior-like cells (ALC) that express ecmA and/or ecmB.
has exact synonym: psp region of the tipped mound
has OBO namespace: Dictyostelium_discoideum_anatomy
id: DDANAT:0000017

Axiom
annotated source: prespore region of the tipped mound
annotated property: IAO_0000115
annotated target: Region of the tipped mound mostly composed of prespore cells. In addition to prespore cells, the prespore region contains anterior-like cells (ALC) that express ecmA and/or ecmB.
has db xref: DDB:pg

prestalk region of the standing slug
type: Class
subclass of: prestalk region
subclass of: Restriction
  on property: BFO_0000050
  some values from: standing slug
subclass of: Restriction
  on property: RO_0002202
  some values from: prestalk region of the tipped mound
IAO_0000115: Elongated protrusion of the standing slug located on top of the cell mass that contains pstA cells flanked by pstO cells (expressing ecmA from the proximal and the distal part of its promoter, respectively).
has db xref: PMID:10642783
has db xref: PMID:2513127
has exact synonym: pst region of the standing slug
has OBO namespace: Dictyostelium_discoideum_anatomy
id: DDANAT:0000019

Axiom
annotated source: prestalk region of the standing slug
annotated property: IAO_0000115
annotated target: Elongated protrusion of the standing slug located on top of the cell mass that contains pstA cells flanked by pstO cells (expressing ecmA from the proximal and the distal part of its promoter, respectively).
has db xref: DDB:pg

prestalk A region of the standing slug
type: Class
subclass of: prestalk A region
subclass of: Restriction
  on property: BFO_0000050
  some values from: prestalk region of the standing slug
subclass of: Restriction
  on property: RO_0002202
  some values from: prestalk region of the tipped mound
IAO_0000115: Most apical region of the prestalk zone of the standing slug characterized by high expression of the ecmA gene directed by the proximal part of its promoter (ecmA promoter).
has db xref: ISBN:0521583640
has exact synonym: pstA region of the standing slug
has OBO namespace: Dictyostelium_discoideum_anatomy
id: DDANAT:0000021
comment: See p. 146 Kessin book.

Axiom
annotated source: prestalk A region of the standing slug
annotated property: IAO_0000115
annotated target: Most apical region of the prestalk zone of the standing slug characterized by high expression of the ecmA gene directed by the proximal part of its promoter (ecmA promoter).
has db xref: DDB:pg

prestalk AB core region of the standing slug
type: Class
subclass of: prestalk AB core region
subclass of: Restriction
  on property: BFO_0000050
  some values from: prestalk region of the standing slug
subclass of: Restriction
  on property: RO_0002202
  some values from: prestalk region of the tipped mound
IAO_0000115: Cone-shaped area of the prestalk zone of the standing slug that occupies a core among the pstA region. Cells of the pstAB region express both the ecmA and ecmB genes.
has db xref: ISBN:0521583640
has exact synonym: prestalk AB region of the standing slug
has narrow synonym: pstAB region
has OBO namespace: Dictyostelium_discoideum_anatomy
id: DDANAT:0000023
comment: See p. 146 Kessin book.

Axiom
annotated source: prestalk AB core region of the standing slug
annotated property: IAO_0000115
annotated target: Cone-shaped area of the prestalk zone of the standing slug that occupies a core among the pstA region. Cells of the pstAB region express both the ecmA and ecmB genes.
has db xref: DDB:pg

prespore region of the standing slug
type: Class
subclass of: prespore region
subclass of: Restriction
  on property: BFO_0000050
  some values from: standing slug
subclass of: Restriction
  on property: RO_0002202
  some values from: prespore region of the tipped mound
IAO_0000115: Region of the standing slug mostly composed of prespore cells. In addition to prespore cells, the prespore region contains anterior-like cells (ALC) that express ecmA and/or ecmB. The prespore region occupies about three quarters of the organism.
has exact synonym: psp region of the standing slug
has OBO namespace: Dictyostelium_discoideum_anatomy
id: DDANAT:0000024

Axiom
annotated source: prespore region of the standing slug
annotated property: IAO_0000115
annotated target: Region of the standing slug mostly composed of prespore cells. In addition to prespore cells, the prespore region contains anterior-like cells (ALC) that express ecmA and/or ecmB. The prespore region occupies about three quarters of the organism.
has db xref: DDB:pg

basal region of the standing slug
type: Class
subclass of: basal region
subclass of: Restriction
  on property: BFO_0000050
  some values from: standing slug
subclass of: Restriction
  on property: RO_0002202
  some values from: tipped mound
IAO_0000115: Region of the standing slug in contact with the substratum and composed of prestalk B cells.
has exact synonym: base of the standing slug
has OBO namespace: Dictyostelium_discoideum_anatomy
id: DDANAT:0000025

Axiom
annotated source: basal region of the standing slug
annotated property: IAO_0000115
annotated target: Region of the standing slug in contact with the substratum and composed of prestalk B cells.
has db xref: DDB:pg

prestalk region of the migratory slug
type: Class
subclass of: prestalk region
subclass of: Restriction
  on property: BFO_0000050
  some values from: migratory slug
subclass of: Restriction
  on property: RO_0002202
  some values from: prestalk region of the standing slug
IAO_0000115: The prestalk region of the migratory slug is located at the anterior of the organism. It consists of about one quarter of the cells.
has exact synonym: pst region of the migratory slug
has OBO namespace: Dictyostelium_discoideum_anatomy
has related synonym: anterior region of the migratory slug
id: DDANAT:0000028

Axiom
annotated source: prestalk region of the migratory slug
annotated property: IAO_0000115
annotated target: The prestalk region of the migratory slug is located at the anterior of the organism. It consists of about one quarter of the cells.
has db xref: DDB:pg

prestalk A region of the migratory slug
type: Class
subclass of: prestalk A region
subclass of: Restriction
  on property: BFO_0000050
  some values from: prestalk region of the migratory slug
subclass of: Restriction
  on property: RO_0002202
  some values from: prestalk A region of the standing slug
IAO_0000115: Anterior-most region of the prestalk zone of the migratory slug and characterized by high expression of the ecmA gene directed by the proximal part of its promoter (ecmA promoter).
has db xref: ISBN:0521583640
has db xref: PMID:10611970
has exact synonym: prestalk AO region of the migratory slug
has exact synonym: pstA region of the migratory slug
has exact synonym: pstAO region of the migratory slug
has OBO namespace: Dictyostelium_discoideum_anatomy
id: DDANAT:0000030
comment: Synonym from Kessin book p. 175.

Axiom
annotated source: prestalk A region of the migratory slug
annotated property: IAO_0000115
annotated target: Anterior-most region of the prestalk zone of the migratory slug and characterized by high expression of the ecmA gene directed by the proximal part of its promoter (ecmA promoter).
has db xref: DDB:pg

prestalk AB core region of the migratory slug
type: Class
subclass of: prestalk AB core region
subclass of: Restriction
  on property: BFO_0000050
  some values from: prestalk region of the migratory slug
subclass of: Restriction
  on property: RO_0002202
  some values from: prestalk AB core region of the standing slug
IAO_0000115: Cone-shaped area of the prestalk zone of the migratory slug that occupies a core among the pstA region. Cells of the pstAB region express both the ecmA and ecmB genes.
has db xref: ISBN:0521583640
has db xref: PMID:8223266
has exact synonym: prestalk AB region of the migratory slug
has exact synonym: pstAB region of the migratory slug
has OBO namespace: Dictyostelium_discoideum_anatomy
id: DDANAT:0000032
comment: See Kessin book p. 146.

Axiom
annotated source: prestalk AB core region of the migratory slug
annotated property: IAO_0000115
annotated target: Cone-shaped area of the prestalk zone of the migratory slug that occupies a core among the pstA region. Cells of the pstAB region express both the ecmA and ecmB genes.
has db xref: DDB:pg

prespore region of the migratory slug
type: Class
subclass of: prespore region
subclass of: Restriction
  on property: BFO_0000050
  some values from: migratory slug
subclass of: Restriction
  on property: RO_0002202
  some values from: prespore region of the standing slug
IAO_0000115: Region of the migratory slug composed mostly of prespore cells. In addition to prespore cells, the prespore region contains anterior-like cells (ALC) that express ecmA and/or ecmB. The prespore region occupies about three quarters of the organism.
has broad synonym: psp region of the migratory slug
has OBO namespace: Dictyostelium_discoideum_anatomy
id: DDANAT:0000033

Axiom
annotated source: prespore region of the migratory slug
annotated property: IAO_0000115
annotated target: Region of the migratory slug composed mostly of prespore cells. In addition to prespore cells, the prespore region contains anterior-like cells (ALC) that express ecmA and/or ecmB. The prespore region occupies about three quarters of the organism.
has db xref: DDB:pg

prestalk region of the early culminant
type: Class
subclass of: prestalk region
subclass of: Restriction
  on property: BFO_0000050
  some values from: early culminant
subclass of: Restriction
  on property: RO_0002202
  some values from: prestalk region of the standing slug
IAO_0000115: The prestalk region of the early culminant is located at the most apical part of the organism. It consists of about one quarter of the cells.
has exact synonym: pst region of the early culminant
has OBO namespace: Dictyostelium_discoideum_anatomy
id: DDANAT:0000037

Axiom
annotated source: prestalk region of the early culminant
annotated property: IAO_0000115
annotated target: The prestalk region of the early culminant is located at the most apical part of the organism. It consists of about one quarter of the cells.
has db xref: DDB:pg

prestalk A region of the early culminant
type: Class
subclass of: prestalk A region
subclass of: Restriction
  on property: BFO_0000050
  some values from: prestalk region of the early culminant
subclass of: Restriction
  on property: RO_0002202
  some values from: prestalk A region of the standing slug
IAO_0000115: Anterior-most region of the prestalk zone of the early culminant characterized by high expression of the ecmA gene directed by the proximal part of its promoter (ecmA promoter).
has exact synonym: pstA region of the early culminant
has OBO namespace: Dictyostelium_discoideum_anatomy
id: DDANAT:0000038

Axiom
annotated source: prestalk A region of the early culminant
annotated property: IAO_0000115
annotated target: Anterior-most region of the prestalk zone of the early culminant characterized by high expression of the ecmA gene directed by the proximal part of its promoter (ecmA promoter).
has db xref: DDB:pg

prestalk AB core region of the early culminant
type: Class
subclass of: prestalk AB core region
subclass of: Restriction
  on property: BFO_0000050
  some values from: prestalk region of the early culminant
subclass of: Restriction
  on property: RO_0002202
  some values from: prestalk AB core region of the standing slug
IAO_0000115: Cone-shaped area of the prestalk zone of the early culminant that occupies a core among the pstA region. Cells of the pstAB region express both the ecmA and ecmB genes.
has exact synonym: prestalk AB region of the early culminant
has exact synonym: pstAB region of the early culminant
has OBO namespace: Dictyostelium_discoideum_anatomy
id: DDANAT:0000040

Axiom
annotated source: prestalk AB core region of the early culminant
annotated property: IAO_0000115
annotated target: Cone-shaped area of the prestalk zone of the early culminant that occupies a core among the pstA region. Cells of the pstAB region express both the ecmA and ecmB genes.
has db xref: DDB:pg

prespore region of the early culminant
type: Class
subclass of: prespore region
subclass of: Restriction
  on property: BFO_0000050
  some values from: early culminant
subclass of: Restriction
  on property: RO_0002202
  some values from: prespore region of the standing slug
IAO_0000115: Region of the early culminant mostly composed of prespore cells. In addition to prespore cells, the prespore region contains anterior-like cells (ALC) that express ecmA and/or ecmB. The prespore region occupies about three quarters of the organism.
has exact synonym: psp region of the early culminant
has OBO namespace: Dictyostelium_discoideum_anatomy
id: DDANAT:0000041

Axiom
annotated source: prespore region of the early culminant
annotated property: IAO_0000115
annotated target: Region of the early culminant mostly composed of prespore cells. In addition to prespore cells, the prespore region contains anterior-like cells (ALC) that express ecmA and/or ecmB. The prespore region occupies about three quarters of the organism.
has db xref: DDB:pg

basal region of the early culminant
type: Class
subclass of: basal region
subclass of: Restriction
  on property: BFO_0000050
  some values from: early culminant
subclass of: Restriction
  on property: RO_0002202
  some values from: basal region of the standing slug
IAO_0000115: Region of the early culminant located at the closest to the substratum composed of pstB cells that originated from rearguard cells.
has db xref: PMID:10611970
has exact synonym: base of the early culminant
has OBO namespace: Dictyostelium_discoideum_anatomy
id: DDANAT:0000045

Axiom
annotated source: basal region of the early culminant
annotated property: IAO_0000115
annotated target: Region of the early culminant located at the closest to the substratum composed of pstB cells that originated from rearguard cells.
has db xref: DDB:pg

prestalk region of the mid culminant
type: Class
subclass of: prestalk region
subclass of: Restriction
  on property: BFO_0000050
  some values from: mid culminant
subclass of: Restriction
  on property: RO_0002202
  some values from: prestalk region of the early culminant
IAO_0000115: The prestalk region of the mid culminant is located at the most apical part of the organism. It consists of about one quarter of the cells.
has exact synonym: pst region of the mid culminant
has OBO namespace: Dictyostelium_discoideum_anatomy
id: DDANAT:0000048

Axiom
annotated source: prestalk region of the mid culminant
annotated property: IAO_0000115
annotated target: The prestalk region of the mid culminant is located at the most apical part of the organism. It consists of about one quarter of the cells.
has db xref: DDB:pg

prestalk A region of the mid culminant
type: Class
subclass of: prestalk A region
subclass of: Restriction
  on property: BFO_0000050
  some values from: prestalk region of the mid culminant
subclass of: Restriction
  on property: RO_0002202
  some values from: prestalk A region of the early culminant
IAO_0000115: Anterior-most region of the prestalk zone of the mid culminant characterized by high expression of the ecmA gene directed by the proximal part of its promoter (ecmA promoter).
has db xref: PMID:2513127
has exact synonym: pstA region of the mid culminant
has OBO namespace: Dictyostelium_discoideum_anatomy
id: DDANAT:0000049

Axiom
annotated source: prestalk A region of the mid culminant
annotated property: IAO_0000115
annotated target: Anterior-most region of the prestalk zone of the mid culminant characterized by high expression of the ecmA gene directed by the proximal part of its promoter (ecmA promoter).
has db xref: DDB:pg

prestalk AB core region of the mid culminant
type: Class
subclass of: prestalk AB core region
subclass of: Restriction
  on property: BFO_0000050
  some values from: prestalk region of the mid culminant
subclass of: Restriction
  on property: RO_0002202
  some values from: prestalk AB core region of the early culminant
IAO_0000115: Cone-shaped area of the prestalk zone of the mid culminant that occupies a core among the pstA region. Cells of the pstAB region express both the ecmA and ecmB genes.
has exact synonym: prestalk AB region of the mid culminant
has exact synonym: pstAB region of the mid culminant
has OBO namespace: Dictyostelium_discoideum_anatomy
id: DDANAT:0000051

Axiom
annotated source: prestalk AB core region of the mid culminant
annotated property: IAO_0000115
annotated target: Cone-shaped area of the prestalk zone of the mid culminant that occupies a core among the pstA region. Cells of the pstAB region express both the ecmA and ecmB genes.
has db xref: DDB:pg

stalk of the mid culminant
type: Class
subclass of: stalk
subclass of: Restriction
  on property: BFO_0000050
  some values from: mid culminant
subclass of: Restriction
  on property: RO_0002202
  some values from: prestalk AB core region of the early culminant
IAO_0000115: Tubular structure of the mid culminant that consists of cellulose-covered cells stacked on top of each other and surrounded by an acellular stalk tube composed of cellulose and glycoprotein.
has db xref: ISBN:0521583640
has exact synonym: sorophore of the mid culminant
has OBO namespace: Dictyostelium_discoideum_anatomy
id: DDANAT:0000052
comment: Synonym from Kessin book p. 12-13; Kessin book p. 193.

Axiom
annotated source: stalk of the mid culminant
annotated property: IAO_0000115
annotated target: Tubular structure of the mid culminant that consists of cellulose-covered cells stacked on top of each other and surrounded by an acellular stalk tube composed of cellulose and glycoprotein.
has db xref: DDB:pg

prespore region of the mid culminant
type: Class
subclass of: prespore region
subclass of: Restriction
  on property: BFO_0000050
  some values from: mid culminant
subclass of: Restriction
  on property: RO_0002202
  some values from: prespore region of the early culminant
IAO_0000115: Region of the mid culminant mostly composed of prespore cells. In addition to prespore cells, the prespore region contains anterior-like cells (ALC) that express ecmA and/or ecmB. The prespore region occupies about three quarters of the organism.
has broad synonym: psp region of the mid culminant
has OBO namespace: Dictyostelium_discoideum_anatomy
id: DDANAT:0000054

Axiom
annotated source: prespore region of the mid culminant
annotated property: IAO_0000115
annotated target: Region of the mid culminant mostly composed of prespore cells. In addition to prespore cells, the prespore region contains anterior-like cells (ALC) that express ecmA and/or ecmB. The prespore region occupies about three quarters of the organism.
has db xref: DDB:pg

basal disc of the mid culminant
type: Class
subclass of: basal disc
subclass of: Restriction
  on property: BFO_0000050
  some values from: mid culminant
subclass of: Restriction
  on property: RO_0002202
  some values from: basal region of the early culminant
IAO_0000115: Region located of the mid culminant located closest to the substratum and composed of pst cells (rearguard cells).
has db xref: PMID:10611970
has OBO namespace: Dictyostelium_discoideum_anatomy
id: DDANAT:0000057

Axiom
annotated source: basal disc of the mid culminant
annotated property: IAO_0000115
annotated target: Region located of the mid culminant located closest to the substratum and composed of pst cells (rearguard cells).
has db xref: DDB:pg
has db xref: PMID:8631253

stalk of the late culminant
type: Class
subclass of: stalk
subclass of: Restriction
  on property: BFO_0000050
  some values from: late culminant
subclass of: Restriction
  on property: RO_0002202
  some values from: stalk of the mid culminant
IAO_0000115: Tubular structure of the late culminant that consists of cellulose-covered cells stacked on top of each other and surrounded by an acellular stalk tube composed of cellulose and glycoprotein.
has db xref: ISBN:0521583640
has exact synonym: sorophore of the late culminant
has OBO namespace: Dictyostelium_discoideum_anatomy
id: DDANAT:0000059
comment: Synonym from Kessin book p. 12-13, Kessin book p. 193.

Axiom
annotated source: stalk of the late culminant
annotated property: IAO_0000115
annotated target: Tubular structure of the late culminant that consists of cellulose-covered cells stacked on top of each other and surrounded by an acellular stalk tube composed of cellulose and glycoprotein.
has db xref: DDB:pg

sorus of the late culminant
type: Class
subclass of: sorus
subclass of: Restriction
  on property: BFO_0000050
  some values from: late culminant
subclass of: Restriction
  on property: RO_0002202
  some values from: prespore region of the mid culminant
IAO_0000115: Ovoid structure of the late culminant supported by the stalk and that contains the spores.
has exact synonym: spore head of the late culminant
has OBO namespace: Dictyostelium_discoideum_anatomy
id: DDANAT:0000061

Axiom
annotated source: sorus of the late culminant
annotated property: IAO_0000115
annotated target: Ovoid structure of the late culminant supported by the stalk and that contains the spores.
has db xref: DDB:pg
has db xref: ISBN:0198529171

basal disc of the late culminant
type: Class
subclass of: basal disc
subclass of: Restriction
  on property: BFO_0000050
  some values from: late culminant
subclass of: Restriction
  on property: RO_0002202
  some values from: basal disc of the mid culminant
IAO_0000115: Conical-shaped structure of the late culminant that anchors the stalk to the substratum. Composed of anterior-like cells.
has OBO namespace: Dictyostelium_discoideum_anatomy
id: DDANAT:0000065

Axiom
annotated source: basal disc of the late culminant
annotated property: IAO_0000115
annotated target: Conical-shaped structure of the late culminant that anchors the stalk to the substratum. Composed of anterior-like cells.
has db xref: DDB:pg
has db xref: PMID:8631253

inner basal disc of the late culminant
type: Class
subclass of: inner basal disc
subclass of: Restriction
  on property: BFO_0000050
  some values from: basal disc of the late culminant
subclass of: Restriction
  on property: RO_0002202
  some values from: stalk of the mid culminant
IAO_0000115: Central portion of the basal disc of the late culminant. Composed of stalk cells.
has OBO namespace: Dictyostelium_discoideum_anatomy
id: DDANAT:0000066

Axiom
annotated source: inner basal disc of the late culminant
annotated property: IAO_0000115
annotated target: Central portion of the basal disc of the late culminant. Composed of stalk cells.
has db xref: DDB:pg

stalk of the fruiting body
type: Class
subclass of: stalk
subclass of: Restriction
  on property: BFO_0000050
  some values from: fruiting body
subclass of: Restriction
  on property: RO_0002202
  some values from: stalk of the late culminant
IAO_0000115: Tubular structure of the fruiting body that consists of cellulose-covered cells stacked on top of each other and surrounded by an acellular stalk tube composed of cellulose and glycoprotein. The stalk of the mature fruiting body is usually 5-15 microns in diameter and between 1.5 to 3 cm in height.
has exact synonym: sorophore of the fruiting body
has OBO namespace: Dictyostelium_discoideum_anatomy
id: DDANAT:0000068

Axiom
annotated source: stalk of the fruiting body
annotated property: IAO_0000115
annotated target: Tubular structure of the fruiting body that consists of cellulose-covered cells stacked on top of each other and surrounded by an acellular stalk tube composed of cellulose and glycoprotein. The stalk of the mature fruiting body is usually 5-15 microns in diameter and between 1.5 to 3 cm in height.
has db xref: DDB:pg
has db xref: PMID:565220

sorus of the fruiting body
type: Class
subclass of: sorus
subclass of: Restriction
  on property: BFO_0000050
  some values from: fruiting body
subclass of: Restriction
  on property: RO_0002202
  some values from: sorus of the late culminant
IAO_0000115: Structure of the fruiting body supported by the stalk and that contains the spores. The sorus is 125-300 microns in diameter, lemon-shaped, and grayish white to pale yellow in color.
has exact synonym: spore head of the fruiting body
has OBO namespace: Dictyostelium_discoideum_anatomy
id: DDANAT:0000070

Axiom
annotated source: sorus of the fruiting body
annotated property: IAO_0000115
annotated target: Structure of the fruiting body supported by the stalk and that contains the spores. The sorus is 125-300 microns in diameter, lemon-shaped, and grayish white to pale yellow in color.
has db xref: DDB:pg

basal disc of the fruiting body
type: Class
subclass of: basal disc
subclass of: Restriction
  on property: BFO_0000050
  some values from: fruiting body
subclass of: Restriction
  on property: RO_0002202
  some values from: basal disc of the late culminant
IAO_0000115: Conical-shaped structure of the fruiting body that anchors the stalk to the substratum, around 150 to 400 microns in diameter. Composed of anterior-like cells.
has OBO namespace: Dictyostelium_discoideum_anatomy
id: DDANAT:0000073

Axiom
annotated source: basal disc of the fruiting body
annotated property: IAO_0000115
annotated target: Conical-shaped structure of the fruiting body that anchors the stalk to the substratum, around 150 to 400 microns in diameter. Composed of anterior-like cells.
has db xref: DDB:pg
has db xref: PMID:8631253

inner basal disc of the fruiting body
type: Class
subclass of: inner basal disc
subclass of: Restriction
  on property: BFO_0000050
  some values from: basal disc of the fruiting body
subclass of: Restriction
  on property: RO_0002202
  some values from: inner basal disc of the late culminant
IAO_0000115: Central portion of the basal disc of the fruiting body composed of stalk cells.
has OBO namespace: Dictyostelium_discoideum_anatomy
id: DDANAT:0000074

Axiom
annotated source: inner basal disc of the fruiting body
annotated property: IAO_0000115
annotated target: Central portion of the basal disc of the fruiting body composed of stalk cells.
has db xref: DDB:pg

Dictyostelium discoideum single cell organism
type: Class
subclass of: cell
IAO_0000115: Cell that is an individual member of the species Dictyostelium discoideum.
has db xref: CARO:0000064
has exact synonym: D. discoideum single cell organism
has OBO namespace: Dictyostelium_discoideum_anatomy
id: DDANAT:0000083

Axiom
annotated source: Dictyostelium discoideum single cell organism
annotated property: IAO_0000115
annotated target: Cell that is an individual member of the species Dictyostelium discoideum.
has db xref: CARO:MAH
has db xref: DDB:PG

prespore region
type: Class
subclass of: subdivision
IAO_0000115: Region mostly composed of prespore cells. In addition to prespore cells, the prespore region contains anterior-like cells (ALC) that express ecmA and/or ecmB. The prespore region occupies about three quarters of the organism.
has exact synonym: psp region
has OBO namespace: Dictyostelium_discoideum_anatomy
id: DDANAT:0000086

Axiom
annotated source: prespore region
annotated property: IAO_0000115
annotated target: Region mostly composed of prespore cells. In addition to prespore cells, the prespore region contains anterior-like cells (ALC) that express ecmA and/or ecmB. The prespore region occupies about three quarters of the organism.
has db xref: DDB:pg

prestalk region
type: Class
subclass of: subdivision
IAO_0000115: The prestalk region is located at the most apical part of the organism. It consists of about one quarter of the cells.
has exact synonym: pst region
has OBO namespace: Dictyostelium_discoideum_anatomy
id: DDANAT:0000087

Axiom
annotated source: prestalk region
annotated property: IAO_0000115
annotated target: The prestalk region is located at the most apical part of the organism. It consists of about one quarter of the cells.
has db xref: DDB:pg

prestalk A region
type: Class
subclass of: subdivision
subclass of: Restriction
  on property: BFO_0000050
  some values from: prestalk region
IAO_0000115: Anterior-most region of the prestalk zone characterized by high expression of the ecmA gene directed by the proximal part of its promoter (ecmA promoter).
has exact synonym: pstA region
has OBO namespace: Dictyostelium_discoideum_anatomy
id: DDANAT:0000088

Axiom
annotated source: prestalk A region
annotated property: IAO_0000115
annotated target: Anterior-most region of the prestalk zone characterized by high expression of the ecmA gene directed by the proximal part of its promoter (ecmA promoter).
has db xref: DDB:pg

basal disc
type: Class
subclass of: subdivision
IAO_0000115: Conical-shaped structure that anchors the stalk to the substratum. Composed of anterior-like cells.
has OBO namespace: Dictyostelium_discoideum_anatomy
id: DDANAT:0000089

Axiom
annotated source: basal disc
annotated property: IAO_0000115
annotated target: Conical-shaped structure that anchors the stalk to the substratum. Composed of anterior-like cells.
has db xref: DDB:pg

prestalk AB core region
type: Class
subclass of: subdivision
subclass of: Restriction
  on property: BFO_0000050
  some values from: prestalk region
IAO_0000115: Cone-shaped area of the prestalk zone that occupies a core among the pstA region. Cells of the pstAB region express both the ecmA and ecmB genes.
has exact synonym: prestalk AB region
has exact synonym: pstAB region
has OBO namespace: Dictyostelium_discoideum_anatomy
id: DDANAT:0000091

Axiom
annotated source: prestalk AB core region
annotated property: IAO_0000115
annotated target: Cone-shaped area of the prestalk zone that occupies a core among the pstA region. Cells of the pstAB region express both the ecmA and ecmB genes.
has db xref: DDB:pg

stalk
type: Class
subclass of: subdivision
IAO_0000115: Tubular structure that consists of cellulose-covered cells stacked on top of each other and surrounded by an acellular stalk tube composed of cellulose and glycoprotein.
has exact synonym: sorophore
has OBO namespace: Dictyostelium_discoideum_anatomy
id: DDANAT:0000093

Axiom
annotated source: stalk
annotated property: IAO_0000115
annotated target: Tubular structure that consists of cellulose-covered cells stacked on top of each other and surrounded by an acellular stalk tube composed of cellulose and glycoprotein.
has db xref: DDB:pg

sorus
type: Class
subclass of: subdivision
IAO_0000115: Ovoid structure supported by the stalk and that contains the spores.
has exact synonym: spore head
has OBO namespace: Dictyostelium_discoideum_anatomy
id: DDANAT:0000094

Axiom
annotated source: sorus
annotated property: IAO_0000115
annotated target: Ovoid structure supported by the stalk and that contains the spores.
has db xref: DDB:pg

inner basal disc
type: Class
subclass of: subdivision
subclass of: Restriction
  on property: BFO_0000050
  some values from: basal disc
IAO_0000115: Central portion of the basal disc. Composed of stalk cells.
has OBO namespace: Dictyostelium_discoideum_anatomy
id: DDANAT:0000098

Axiom
annotated source: inner basal disc
annotated property: IAO_0000115
annotated target: Central portion of the basal disc. Composed of stalk cells.
has db xref: DDB:pg

prestalk A region of the tipped mound
type: Class
subclass of: prestalk A region
subclass of: Restriction
  on property: BFO_0000050
  some values from: prestalk region of the tipped mound
IAO_0000115: Anterior-most region of the prestalk zone of the tipped mound characterized by high expression of the ecmA gene directed by the proximal part of its promoter (ecmA promoter).
has exact synonym: pstA region of the tipped mound
has OBO namespace: Dictyostelium_discoideum_anatomy
id: DDANAT:0000100

Axiom
annotated source: prestalk A region of the tipped mound
annotated property: IAO_0000115
annotated target: Anterior-most region of the prestalk zone of the tipped mound characterized by high expression of the ecmA gene directed by the proximal part of its promoter (ecmA promoter).
has db xref: DDB:pg

prestalk AB core region of the tipped mound
type: Class
subclass of: prestalk AB core region
subclass of: Restriction
  on property: BFO_0000050
  some values from: prestalk region of the tipped mound
IAO_0000115: Cone-shaped area of the prestalk zone of the tipped mound that occupies a core among the pstA region. Cells of the pstAB region express both the ecmA and ecmB genes.
has exact synonym: prestalk AB region of the tipped mound
has narrow synonym: pstAB region
has OBO namespace: Dictyostelium_discoideum_anatomy
id: DDANAT:0000101

Axiom
annotated source: prestalk AB core region of the tipped mound
annotated property: IAO_0000115
annotated target: Cone-shaped area of the prestalk zone of the tipped mound that occupies a core among the pstA region. Cells of the pstAB region express both the ecmA and ecmB genes.
has db xref: DDB:pg

basal region
type: Class
subclass of: subdivision
IAO_0000115: Region of the early pseudoplasmodium located at the closest to the substratum composed of pstB cells.
has exact synonym: base
has OBO namespace: Dictyostelium_discoideum_anatomy
id: DDANAT:0000110

Axiom
annotated source: basal region
annotated property: IAO_0000115
annotated target: Region of the early pseudoplasmodium located at the closest to the substratum composed of pstB cells.
has db xref: DDB:pg

cell
type: Class
subclass of: Dictyostelium discoideum anatomical structure
IAO_0000115: Anatomical structure that has as its parts a maximally connected cell compartment surrounded by a plasma membrane.
has OBO namespace: Dictyostelium_discoideum_anatomy
id: DDANAT:0000401

Axiom
annotated source: cell
annotated property: IAO_0000115
annotated target: Anatomical structure that has as its parts a maximally connected cell compartment surrounded by a plasma membrane.
has db xref: CARO:MAH

chemotactic amoeboid cell
type: Class
subclass of: Dictyostelium discoideum single cell organism
subclass of: Restriction
  on property: BFO_0000050
  some values from: stream
subclass of: Restriction
  on property: RO_0002202
  some values from: spore
IAO_0000115: Starved cell that secretes and responds to chemoattractants (cAMP).
has broad synonym: amoebae
has OBO namespace: Dictyostelium_discoideum_anatomy
id: DDANAT:0000402

Axiom
annotated source: chemotactic amoeboid cell
annotated property: IAO_0000115
annotated target: Starved cell that secretes and responds to chemoattractants (cAMP).
has db xref: DDB:pg
has db xref: PMID:4338436

aggregate cell
type: Class
subclass of: cell
subclass of: Restriction
  on property: BFO_0000050
  some values from: aggregation territory
subclass of: Restriction
  on property: BFO_0000050
  some values from: loose aggregate
subclass of: Restriction
  on property: BFO_0000050
  some values from: mound
subclass of: Restriction
  on property: RO_0002202
  some values from: chemotactic amoeboid cell
IAO_0000115: Differentiating cell composing the aggregate that has acquired adhesive properties.
has OBO namespace: Dictyostelium_discoideum_anatomy
id: DDANAT:0000403

Axiom
annotated source: aggregate cell
annotated property: IAO_0000115
annotated target: Differentiating cell composing the aggregate that has acquired adhesive properties.
has db xref: DDB:pg

prespore cell
type: Class
subclass of: cell
subclass of: Restriction
  on property: BFO_0000050
  some values from: loose aggregate
subclass of: Restriction
  on property: BFO_0000050
  some values from: prespore region of the tipped mound
subclass of: Restriction
  on property: BFO_0000050
  some values from: prespore region of the standing slug
subclass of: Restriction
  on property: BFO_0000050
  some values from: prespore region of the migratory slug
subclass of: Restriction
  on property: BFO_0000050
  some values from: prespore region of the early culminant
subclass of: Restriction
  on property: BFO_0000050
  some values from: prespore region of the mid culminant
subclass of: Restriction
  on property: BFO_0000050
  some values from: sorus of the late culminant
subclass of: Restriction
  on property: RO_0002202
  some values from: aggregate cell
IAO_0000115: Cell that is undergoing differentiation to become a spore. Characterized by the presence of prespore vesicles (PV).
has exact synonym: psp cell
has OBO namespace: Dictyostelium_discoideum_anatomy
id: DDANAT:0000405

Axiom
annotated source: prespore cell
annotated property: IAO_0000115
annotated target: Cell that is undergoing differentiation to become a spore. Characterized by the presence of prespore vesicles (PV).
has db xref: DDB:pg
has db xref: PMID:4330277

prestalk cell
type: Class
subclass of: cell
IAO_0000115: Cell that is undergoing differentiation to become a stalk cell and characterized by the ability to update vital dyes. Represents about one-quarter of the cells. During development, prestalk cells are located in the anterior portion of the organism.
has exact synonym: anterior cell
has exact synonym: pst cell
has OBO namespace: Dictyostelium_discoideum_anatomy
id: DDANAT:0000406

Axiom
annotated source: prestalk cell
annotated property: IAO_0000115
annotated target: Cell that is undergoing differentiation to become a stalk cell and characterized by the ability to update vital dyes. Represents about one-quarter of the cells. During development, prestalk cells are located in the anterior portion of the organism.
has db xref: DDB:pg
has db xref: PMID:4330277

pstA cell
type: Class
subclass of: prestalk cell
subclass of: Restriction
  on property: BFO_0000050
  some values from: loose aggregate
subclass of: Restriction
  on property: BFO_0000050
  some values from: mound
subclass of: Restriction
  on property: BFO_0000050
  some values from: prestalk A region of the standing slug
subclass of: Restriction
  on property: BFO_0000050
  some values from: prestalk A region of the migratory slug
subclass of: Restriction
  on property: BFO_0000050
  some values from: prestalk A region of the early culminant
subclass of: Restriction
  on property: BFO_0000050
  some values from: prestalk A region of the mid culminant
subclass of: Restriction
  on property: BFO_0000050
  some values from: prestalk A region of the tipped mound
IAO_0000115: Cell that is undergoing differentiation to become a stalk cell. pstA cells express the ecmA marker from a promoter region that is proximal to the ATG (ecmAO promoter). They are located at the anterior-most region of the slug. During culmination pstA cells differentiate into pstAB cells.
has exact synonym: prestalk A cell
has exact synonym: pstAO cell
has OBO namespace: Dictyostelium_discoideum_anatomy
id: DDANAT:0000408

Axiom
annotated source: pstA cell
annotated property: IAO_0000115
annotated target: Cell that is undergoing differentiation to become a stalk cell. pstA cells express the ecmA marker from a promoter region that is proximal to the ATG (ecmAO promoter). They are located at the anterior-most region of the slug. During culmination pstA cells differentiate into pstAB cells.
has db xref: DDB:pg

pstAB cell
type: Class
subclass of: prestalk cell
subclass of: Restriction
  on property: BFO_0000050
  some values from: mound
subclass of: Restriction
  on property: BFO_0000050
  some values from: prestalk AB core region of the standing slug
subclass of: Restriction
  on property: BFO_0000050
  some values from: prestalk AB core region of the migratory slug
subclass of: Restriction
  on property: BFO_0000050
  some values from: prestalk AB core region of the early culminant
subclass of: Restriction
  on property: BFO_0000050
  some values from: prestalk AB core region of the mid culminant
subclass of: Restriction
  on property: BFO_0000050
  some values from: prestalk AB core region of the tipped mound
subclass of: Restriction
  on property: RO_0002202
  some values from: pstA cell
IAO_0000115: Cell that is undergoing differentiation to become a stalk cell. pstAB cells express both ecmA and ecmB either simultaneously or sequentially. During culmination pstA differentiate into pstAB cells.
has exact synonym: prestalk AB cell
has OBO namespace: Dictyostelium_discoideum_anatomy
id: DDANAT:0000410

Axiom
annotated source: pstAB cell
annotated property: IAO_0000115
annotated target: Cell that is undergoing differentiation to become a stalk cell. pstAB cells express both ecmA and ecmB either simultaneously or sequentially. During culmination pstA differentiate into pstAB cells.
has db xref: DDB:pg

stalk cell
type: Class
subclass of: cell
subclass of: Restriction
  on property: BFO_0000050
  some values from: stalk of the mid culminant
subclass of: Restriction
  on property: BFO_0000050
  some values from: stalk of the late culminant
subclass of: Restriction
  on property: BFO_0000050
  some values from: inner basal disc of the late culminant
subclass of: Restriction
  on property: BFO_0000050
  some values from: stalk of the fruiting body
subclass of: Restriction
  on property: BFO_0000050
  some values from: inner basal disc of the fruiting body
subclass of: Restriction
  on property: RO_0002202
  some values from: pstAB cell
IAO_0000115: Cell of polyhedric shape filling the stalk tube. Stack cells are large (around 8 microns in diameter), highly vacuolated, and are surrounded by cell wall composed of cellulose. Stalk cells die upon terminal differentiation. Their role is to provide structural support for the fruiting body.
has OBO namespace: Dictyostelium_discoideum_anatomy
id: DDANAT:0000413

Axiom
annotated source: stalk cell
annotated property: IAO_0000115
annotated target: Cell of polyhedric shape filling the stalk tube. Stack cells are large (around 8 microns in diameter), highly vacuolated, and are surrounded by cell wall composed of cellulose. Stalk cells die upon terminal differentiation. Their role is to provide structural support for the fruiting body.
has db xref: DDB:pg

spore
type: Class
subclass of: Dictyostelium discoideum single cell organism
subclass of: Restriction
  on property: BFO_0000050
  some values from: sorus of the fruiting body
subclass of: Restriction
  on property: RO_0002202
  some values from: prespore cell
IAO_0000115: Dormant cell protected by a tri-layer spore coat. The spore has an elliptical shape and is approximately 6-9 microns by 3 microns.
has exact synonym: spore cell
has OBO namespace: Dictyostelium_discoideum_anatomy
id: DDANAT:0000414

Axiom
annotated source: spore
annotated property: IAO_0000115
annotated target: Dormant cell protected by a tri-layer spore coat. The spore has an elliptical shape and is approximately 6-9 microns by 3 microns.
has db xref: DDB:pg
has db xref: PMID:4338436

Dictyostelium discoideum anatomical structure
type: Class
IAO_0000115: Material anatomical entity that has inherent 3D shape and is generated by coordinated expression of the Dictyostelium discoideum genome.
has alternative id: DDANAT:0000001
has OBO namespace: Dictyostelium_discoideum_anatomy
id: DDANAT:0010001

Axiom
annotated source: Dictyostelium discoideum anatomical structure
annotated property: IAO_0000115
annotated target: Material anatomical entity that has inherent 3D shape and is generated by coordinated expression of the Dictyostelium discoideum genome.
has db xref: CARO:MAH

whole organism
type: Class
subclass of: Dictyostelium discoideum anatomical structure
IAO_0000115: Anatomical structure that is an individual member of the Dictyostelium discoideum species and consists of more than one cell.
has alternative id: DDANAT:0000082
has db xref: CARO:0000012
has OBO namespace: Dictyostelium_discoideum_anatomy
id: DDANAT:0010082

Axiom
annotated source: whole organism
annotated property: IAO_0000115
annotated target: Anatomical structure that is an individual member of the Dictyostelium discoideum species and consists of more than one cell.
has db xref: CARO:MAH

subdivision
type: Class
subclass of: Dictyostelium discoideum anatomical structure
IAO_0000115: Anatomical structure which is a primary subdivision of whole Dictyostelium organism. The mereological sum of these is the whole organism.
has alternative id: DDANAT:0000085
has db xref: CARO:0000032
has OBO namespace: Dictyostelium_discoideum_anatomy
id: DDANAT:0010085

Axiom
annotated source: subdivision
annotated property: IAO_0000115
annotated target: Anatomical structure which is a primary subdivision of whole Dictyostelium organism. The mereological sum of these is the whole organism.
has db xref: DDB:pg