metacyclic promastigote stage
type: Class
subclass of: promastigote stage
subclass of: Trypanosomatida metacyclic stage
subclass of: Restriction
  on property: BFO_0000055
  some values from: IDO_0000404
IAO_0000115: A promastigote stage of some kinetoplastids.
IAO_0000117: Chris Stoeckert
IAO_0000117: Jie Zheng
IAO_0000117: Priti Parikh
IAO_0000119: PMID:13129524

bloodstream trypomastigote stage
type: Class
subclass of: trypomastigote stage
IAO_0000115: A trypomastigote stage where trypmastigote form of parasites are found in mammalian host blood stream.
IAO_0000117: Chris Stoeckert
IAO_0000117: Jie Zheng
IAO_0000117: Priti Parikh

trypomastigote stage
type: Class
subclass of: parasite lifecycle stage
subclass of: Restriction
  on property: RO_0002162
  some values from: NCBITaxon 5690
IAO_0000115: A parasite lifecycle stage of trypanosomes. In trypomastigote stage, the kinetoplast is near the posterior end of the body, and the flagellum lies attached to the cell body for most of its length by an undulating membrane.
IAO_0000117: Chris Stoeckert
IAO_0000117: Jie Zheng
IAO_0000117: Priti Parikh
IAO_0000119: Wikipedia: Trypanosomatid

procyclic trypomastigote stage
type: Class
subclass of: trypomastigote stage
subclass of: Trypanosomatida procyclic stage
subclass of: Restriction
  on property: BFO_0000051
  some values from: GO_0051301
subclass of: Restriction
  on property: BFO_0000066
  some values from: Class
    union of: Phlebotominae midgut
    union of: Glossina midgut
IAO_0000115: A trypomastigote stage where trypomastigote form of parasites are in dividing form. This stage occurs in fly vector.
IAO_0000117: Chris Stoeckert
IAO_0000117: Jie Zheng
IAO_0000117: Priti Parikh

amastigote stage
type: Class
subclass of: parasite lifecycle stage
subclass of: Restriction
  on property: RO_0002162
  some values from: parasite organism
IAO_0000115: A parasite lifecycle stage is a nonflagellate intracellular developmental stage in the trypanosomatid parasites lifecycle that occurs in mammalian host.
IAO_0000117: Chris Stoeckert
IAO_0000117: Jie Zheng
IAO_0000117: Priti Parikh

metacyclic trypomastigote stage
type: Class
subclass of: trypomastigote stage
subclass of: Trypanosomatida metacyclic stage
subclass of: Restriction
  on property: BFO_0000055
  some values from: IDO_0000404
IAO_0000115: A trypomastigote stage of Trypanosoma species which are nondividing forms resistant to mammalian complement that have the capacity to infect mammalian cells.
IAO_0000117: Chris Stoeckert
IAO_0000117: Jie Zheng
IAO_0000117: Priti Parikh

promastigote stage
type: Class
subclass of: parasite lifecycle stage
subclass of: Restriction
  on property: RO_0002162
  some values from: NCBITaxon 5654
IAO_0000115: A parasite lifecycle stage of Trypanosomatids. In this stage, the flagellum is found anterior of nucleus and flagellum not attached to the cell body. The kinetoplast is located in front of the nucleus, near the anterior end of the body. (Wikipedia: Trypanosomatid)
IAO_0000117: Chris Stoeckert
IAO_0000117: Jie Zheng
IAO_0000117: Priti Parikh

parasite lifecycle stage
type: Class
equivalent class: Class
  intersection of: UBERON_0000105
  intersection of: Restriction
    on property: RO_0002162
    some values from: parasite organism
subclass of: UBERON_0000105
IAO_0000115: A life cycle stage of a parasite.
IAO_0000117: Chris Stoeckert
IAO_0000117: Jie Zheng
IAO_0000117: Priti Parikh

Phlebotominae midgut
type: Class
equivalent class: Class
  intersection of: UBERON_0001045
  intersection of: Restriction
    on property: BFO_0000050
    some values from: NCBITaxon 7198
subclass of: UBERON_0001045
IAO_0000115: A midgut that is a part of or originated from a sand fly of genus Phlebotominae.
IAO_0000117: Priti Parikh

Glossina midgut
type: Class
equivalent class: Class
  intersection of: UBERON_0001045
  intersection of: Restriction
    on property: BFO_0000050
    some values from: NCBITaxon 7393
subclass of: UBERON_0001045
IAO_0000115: A midgut that is a part of or originated from a tsetse fly of genus Glossina.
IAO_0000117: Priti Parikh

parasite organism
type: Class
equivalent class: Class
  intersection of: OBI_0100026
  intersection of: Restriction
    on property: RO_0000087
    some values from: IDO_0000403
subclass of: OBI_0100026
IAO_0000115: An organism living in, with, or on another organism in parasitism. Individual members of parasite species, such as Leishmania, Plasmodium, Trypanosoma, etc. are members of this class.
IAO_0000117: Jie Zheng
IAO_0000117: Priti Parikh
IAO_0000119: http://www.merriam-webster.com/dictionary/parasite

Trypanosomatida metacyclic stage
type: Class
equivalent class: Class
  intersection of: parasite lifecycle stage
  intersection of: Restriction
    on property: BFO_0000055
    some values from: IDO_0000404
  intersection of: Restriction
    on property: RO_0002162
    some values from: NCBITaxon 5654
subclass of: parasite lifecycle stage
IAO_0000115: A parasite lifecycle stage of trypanosomatidae in which the organism is infectious and does not multiply.
IAO_0000117: Chris Stoeckert
IAO_0000117: Jie Zheng
IAO_0000118: metacyclic stage
IAO_0000119: https://microbewiki.kenyon.edu/index.php/Trypanosome_Life_Cycle
IAO_0000119: https://web.stanford.edu/group/parasites/ParaSites2003/Leishmania/Leish%20Biology.html
IAO_0000233: https://github.com/OPL-ontology/OPL/issues/9

Trypanosomatida procyclic stage
type: Class
equivalent class: Class
  intersection of: parasite lifecycle stage
  intersection of: Restriction
    on property: BFO_0000051
    some values from: GO_0051301
  intersection of: Restriction
    on property: RO_0002162
    some values from: NCBITaxon 5654
subclass of: parasite lifecycle stage
subclass of: Restriction
  on property: BFO_0000066
  some values from: Class
    union of: Phlebotominae midgut
    union of: Glossina midgut
IAO_0000115: A parasite lifecycle stage of trypanosomatidae in which the organism is in dividing form and it occurs in fly vector.
IAO_0000117: Achchuthan Shanmugasundram
IAO_0000117: Chris Stoeckert
IAO_0000117: Jie Zheng
IAO_0000118: procyclic stage
IAO_0000119: VEuPathDB
IAO_0000233: https://github.com/OPL-ontology/OPL/issues/10